BDBM50409847 CHEMBL131784
SMILES Cc1csc2c1ncn1c(NS(=O)(=O)c3cc(C)c(Cl)cc3S)nnc21
InChI Key InChIKey=RMRQBGAYOVPHPI-UHFFFAOYSA-N
Data  3 IC50
  Tab Delimited (TSV)   2D SDfile   Computed 3D by Vconf -m prep SDfile
Find this compound or compounds like it in BindingDB:
Activity Spreadsheet -- Enzyme Inhibition Constant Data from BindingDB
Found 3 hits for monomerid = 50409847
TargetIntegrase(Human immunodeficiency virus 1)
University Of Southern California
Curated by ChEMBL
LigandPNGBDBM50409847(CHEMBL131784)
Affinity DataIC50:  7.41E+3nM. Assay description: Inhibitory activity against DNA strand transfer by HIV integrase
In DepthDetails ArticlePubMed
TargetIntegrase(Human immunodeficiency virus 1)TBA
LigandPNGBDBM50409847(CHEMBL131784)
Affinity DataIC50:  4.26E+3nM. Assay description: Inhibition of Human immunodeficiency virus 1 integrase strand transfer activity using [32P]5'end-labeled linear 21 mer as substrate incubated for 30 ...
In DepthDetails Article
TargetIntegrase(Human immunodeficiency virus 1)
University Of Southern California
Curated by ChEMBL
LigandPNGBDBM50409847(CHEMBL131784)
Affinity DataIC50:  9.33E+3nM. Assay description: Inhibitory activity against 3' processing by HIV integrase
In DepthDetails ArticlePubMed