BDBM50409857 CHEMBL339347
SMILES Cc1cc(c(S)cc1Cl)S(=O)(=O)Nc1nc2ccccc2nc1-c1ccc(Cl)cc1
InChI Key InChIKey=LPXHZSBXBCYGMB-UHFFFAOYSA-N
Data  2 IC50
  Tab Delimited (TSV)   2D SDfile   Computed 3D by Vconf -m prep SDfile
Find this compound or compounds like it in BindingDB:
Activity Spreadsheet -- Enzyme Inhibition Constant Data from BindingDB
Found 2 hits for monomerid = 50409857
TargetIntegrase(Human immunodeficiency virus 1)
University Of Southern California
Curated by ChEMBL
LigandPNGBDBM50409857(CHEMBL339347)
Affinity DataIC50:  2.00E+4nM. Assay description: Inhibitory activity against 3' processing by HIV integrase
In DepthDetails ArticlePubMed
TargetIntegrase(Human immunodeficiency virus 1)
University Of Southern California
Curated by ChEMBL
LigandPNGBDBM50409857(CHEMBL339347)
Affinity DataIC50:  1.20E+4nM. Assay description: Inhibitory activity against DNA strand transfer by HIV integrase
In DepthDetails ArticlePubMed