BDBM50409888 CHEMBL130134
SMILES Cc1ccc(NC(=O)c2cc(c(S)cc2Cl)S(=O)(=O)Nc2nncn2Cc2ccccc2)cc1
InChI Key InChIKey=UXSFOGVDRFWPSF-UHFFFAOYSA-N
Data  2 IC50
  Tab Delimited (TSV)   2D SDfile   Computed 3D by Vconf -m prep SDfile
Find this compound or compounds like it in BindingDB:
Activity Spreadsheet -- Enzyme Inhibition Constant Data from BindingDB
Found 2 hits for monomerid = 50409888
TargetIntegrase(Human immunodeficiency virus 1)
University Of Southern California
Curated by ChEMBL
LigandPNGBDBM50409888(CHEMBL130134)
Affinity DataIC50:  7.94E+3nM. Assay description: Inhibitory activity against DNA strand transfer by HIV integrase
In DepthDetails ArticlePubMed
TargetIntegrase(Human immunodeficiency virus 1)
University Of Southern California
Curated by ChEMBL
LigandPNGBDBM50409888(CHEMBL130134)
Affinity DataIC50:  8.91E+3nM. Assay description: Inhibitory activity against 3' processing by HIV integrase
In DepthDetails ArticlePubMed