BDBM50410871 CHEMBL208350
SMILES CCC[C@@H]([C@@H](CC(C)C)C(=O)N[C@H]1CCCCN(Cc2cccc(Nc3cccc(C)c3)c2)C1=O)C(N)=O
InChI Key InChIKey=PEVYWDOOJHNLRB-IARZGTGTSA-N
Data  1 IC50
  Tab Delimited (TSV)   2D SDfile   Computed 3D by Vconf -m prep SDfile
Find this compound or compounds like it in BindingDB:
Activity Spreadsheet -- Enzyme Inhibition Constant Data from BindingDB
Found 1 hit for monomerid = 50410871
TargetAmyloid-beta precursor protein(Homo sapiens (Human))
Bristol-Myers Squibb Pharmaceutical Research Institute
Curated by ChEMBL
LigandPNGBDBM50410871(CHEMBL208350)
Affinity DataIC50:  17nM. Assay description: Inhibition of beta-amyloid peptide production in CHO N9 cell line
In DepthDetails ArticlePubMed