BDBM50411295 CHEMBL220783
SMILES Cc1cccc(n1)-c1cnc(o1)C(=O)CCCCCCc1ccccc1
InChI Key InChIKey=DEUJPRBSWMXMKH-UHFFFAOYSA-N
Data  1 KI
  Tab Delimited (TSV)   2D SDfile   Computed 3D by Vconf -m prep SDfile
Find this compound or compounds like it in BindingDB:
Activity Spreadsheet -- Enzyme Inhibition Constant Data from BindingDB
Found 1 hit for monomerid = 50411295
TargetFatty-acid amide hydrolase 1(Homo sapiens (Human))
The Scripps Research Institute
Curated by ChEMBL
LigandPNGBDBM50411295(CHEMBL220783)
Affinity DataKi:  3.30nM. Assay description: Inhibition of rat recombinant FAAH expressed in Escherichia coli by [14C]oleamide breakdown
In DepthDetails ArticlePubMed