BDBM50411457 CHEMBL1162040
SMILES Nc1ncnc2n(cnc12)[C@@H]1O[C@H](COS(=O)(=O)NC(=O)c2c(O)cccc2F)[C@@H](O)[C@H]1O
InChI Key InChIKey=MNXSVFWFEXFDGV-DMEFTLKTSA-N
Data  1 KI
  Tab Delimited (TSV)   2D SDfile   Computed 3D by Vconf -m prep SDfile
Find this compound or compounds like it in BindingDB:
Activity Spreadsheet -- Enzyme Inhibition Constant Data from BindingDB
Found 1 hit for monomerid = 50411457
TargetSalicyl-AMP ligase / salicyl-S-ArCP synthetase(Mycobacterium tuberculosis)
University Of Minnesota
Curated by ChEMBL
LigandPNGBDBM50411457(CHEMBL1162040)
Affinity DataKi:  7.30nM. Assay description: Inhibition of Mycobacterium tuberculosis recombinant MbtA expressed in Escherichia coli by ATP/PPi exchange assay
In DepthDetails ArticlePubMed