BDBM50411467 CHEMBL1162032
SMILES Nc1ncnc2n(cnc12)[C@@H]1O[C@H](COS(=O)(=O)NC(=O)c2cccc(Cl)c2O)[C@@H](O)[C@H]1O
InChI Key InChIKey=GIEHYBQLTFEGIZ-DMEFTLKTSA-N
Data  1 KI
  Tab Delimited (TSV)   2D SDfile   Computed 3D by Vconf -m prep SDfile
Find this compound or compounds like it in BindingDB:
Activity Spreadsheet -- Enzyme Inhibition Constant Data from BindingDB
Found 1 hit for monomerid = 50411467
TargetSalicyl-AMP ligase / salicyl-S-ArCP synthetase(Mycobacterium tuberculosis)
University Of Minnesota
Curated by ChEMBL
LigandPNGBDBM50411467(CHEMBL1162032)
Affinity DataKi:  61nM. Assay description: Inhibition of Mycobacterium tuberculosis recombinant MbtA expressed in Escherichia coli by ATP/PPi exchange assay
In DepthDetails ArticlePubMed