BDBM50412607 CHEMBL516033
SMILES CCN(CC(O)(CNC(=O)c1cnn(c1N)-c1ccc(F)cc1)C(F)(F)F)C(=O)c1c(F)cccc1S(C)(=O)=O
InChI Key InChIKey=JSLURERBIYFOSA-UHFFFAOYSA-N
Data  1 IC50  1 EC50
  Tab Delimited (TSV)   2D SDfile   Computed 3D by Vconf -m prep SDfile
Find this compound or compounds like it in BindingDB:
Activity Spreadsheet -- Enzyme Inhibition Constant Data from BindingDB
Found 2 hits for monomerid = 50412607
TargetGlucocorticoid receptor(Homo sapiens (Human))
Medicines Research Centre
Curated by ChEMBL
LigandPNGBDBM50412607(CHEMBL516033)
Affinity DataIC50:  50.1nM. Assay description: Displacement of fluorescent labelled Dexamethasone from glucocorticoid receptor
In DepthDetails ArticlePubMed
TargetGlucocorticoid receptor(Homo sapiens (Human))
Medicines Research Centre
Curated by ChEMBL
LigandPNGBDBM50412607(CHEMBL516033)
Affinity DataEC50:  25.1nM. Assay description: Agonist activity at human glucocorticoid receptor in human A549 cells assessed as transcriptional activity by MMTV luciferase reporter gene assay
In DepthDetails ArticlePubMed