BDBM50412824 CHEMBL611766
SMILES Nc1nc(nc2n(cnc12)C1OC(COS(=O)(=O)NC(=O)c2ccccc2O)C(O)C1O)-n1cc(nn1)C1CCCCC1
InChI Key InChIKey=YPQFGJKEAGRQTN-UHFFFAOYSA-N
Data  1 KI
  Tab Delimited (TSV)   2D SDfile   Computed 3D by Vconf -m prep SDfile
Find this compound or compounds like it in BindingDB:
Activity Spreadsheet -- Enzyme Inhibition Constant Data from BindingDB
Found 1 hit for monomerid = 50412824
TargetSalicyl-AMP ligase / salicyl-S-ArCP synthetase(Mycobacterium tuberculosis)
University Of Minnesota
Curated by ChEMBL
LigandPNGBDBM50412824(CHEMBL611766)
Affinity DataKi:  0.320nM. Assay description: Inhibition of Mycobacterium tuberculosis MbtA expressed in Escherichia coli assessed as ATP-[32P]Ppi exchange
In DepthDetails ArticlePubMed