BDBM50412841 CHEMBL611782
SMILES Nc1nc(nc2n(cnc12)C1OC(COS(=O)(=O)NC(=O)c2ccccc2O)C(O)C1O)-n1cc(nn1)-c1ccc(O)cc1
InChI Key InChIKey=PQWRZBDIAOCWNP-UHFFFAOYSA-N
Data  1 KI
  Tab Delimited (TSV)   2D SDfile   Computed 3D by Vconf -m prep SDfile
Find this compound or compounds like it in BindingDB:
Activity Spreadsheet -- Enzyme Inhibition Constant Data from BindingDB
Found 1 hit for monomerid = 50412841
TargetSalicyl-AMP ligase / salicyl-S-ArCP synthetase(Mycobacterium tuberculosis)
University Of Minnesota
Curated by ChEMBL
LigandPNGBDBM50412841(CHEMBL611782)
Affinity DataKi:  0.610nM. Assay description: Inhibition of Mycobacterium tuberculosis MbtA expressed in Escherichia coli assessed as ATP-[32P]Ppi exchange
In DepthDetails ArticlePubMed