BDBM50414717 CHEMBL552484
SMILES COc1cc(N)c(Cl)cc1C(=O)NC1CCN(CCCCCCCCN(C)CCc2c[nH]c3ccccc23)CC1
InChI Key InChIKey=AEPMXCLJHNXORS-UHFFFAOYSA-N
Data  1 KI  1 EC50
  Tab Delimited (TSV)   2D SDfile   Computed 3D by Vconf -m prep SDfile
Find this compound or compounds like it in BindingDB:
Activity Spreadsheet -- Enzyme Inhibition Constant Data from BindingDB
Found 1 hit for monomerid = 50414717
Target5-hydroxytryptamine receptor 4(Homo sapiens (Human))
Theravance
Curated by ChEMBL
LigandPNGBDBM50414717(CHEMBL552484)
Affinity DataKi:  1.26nM. Assay description: Displacement of [H]GR-113808 from human 5HT4C receptor expressed in HEK293 cells by liquid scintillation counting
In DepthDetails ArticlePubMed