BDBM50415420 CHEMBL592158
SMILES CN(C(=O)c1conc1-c1ccccc1Cl)c1ccc(Cl)cc1
InChI Key InChIKey=BGKSZURFTXDSNL-UHFFFAOYSA-N
Data  1 EC50
  Tab Delimited (TSV)   2D SDfile   Computed 3D by Vconf -m prep SDfile
Find this compound or compounds like it in BindingDB:
Activity Spreadsheet -- Enzyme Inhibition Constant Data from BindingDB
Found 1 hit for monomerid = 50415420
TargetG-protein coupled bile acid receptor 1(Homo sapiens (Human))
Glaxosmithkline
Curated by ChEMBL
LigandPNGBDBM50415420(CHEMBL592158)
Affinity DataEC50:  1.26E+3nM. Assay description: Agonist activity at human TGR5 receptor expressed in human U2-OS cells assessed as changes in response to cAMP level by MRE/CRE-driven luciferase rep...
In DepthDetails ArticlePubMed