BDBM50416059 CHEMBL1085399
SMILES CS(=O)(=O)Nc1cccc(COCCOCCCCCCNC[C@H](O)c2ccc(O)c(CO)c2)c1
InChI Key InChIKey=VNMPYMOGIPEHPS-VWLOTQADSA-N
Data  3 EC50
  Tab Delimited (TSV)   2D SDfile   Computed 3D by Vconf -m prep SDfile
Find this compound or compounds like it in BindingDB:
Activity Spreadsheet -- Enzyme Inhibition Constant Data from BindingDB
Found 3 hits for monomerid = 50416059
TargetBeta-2 adrenergic receptor(Homo sapiens (Human))
Glaxosmithkline
Curated by ChEMBL
LigandPNGBDBM50416059(CHEMBL1085399)
Affinity DataEC50:  0.251nM. Assay description: Agonist activity at human recombinant beta2 adrenergic receptor expressed in CHO cells assessed as induction of intracellular cAMP accumulation after...
In DepthDetails ArticlePubMed
TargetBeta-1 adrenergic receptor(Homo sapiens (Human))
Glaxosmithkline
Curated by ChEMBL
LigandPNGBDBM50416059(CHEMBL1085399)
Affinity DataEC50:  13nM. Assay description: Agonist activity at human recombinant beta-1 adrenergic receptor expressed in CHO cells assessed as induction of intracellular cAMP accumulation afte...
In DepthDetails ArticlePubMed
TargetBeta-3 adrenergic receptor(Homo sapiens (Human))
Glaxosmithkline
Curated by ChEMBL
LigandPNGBDBM50416059(CHEMBL1085399)
Affinity DataEC50:  79nM. Assay description: Agonist activity at human recombinant beta3 adrenergic receptor expressed in CHO cells assessed as induction of intracellular cAMP accumulation after...
In DepthDetails ArticlePubMed