BDBM50416070 CHEMBL1084654
SMILES OCc1cc(ccc1O)[C@@H](O)CNCCCCCCOCCOCc1ccc(Cl)cc1
InChI Key InChIKey=FHBTZIMKHULVJR-DEOSSOPVSA-N
Data  1 EC50
  Tab Delimited (TSV)   2D SDfile   Computed 3D by Vconf -m prep SDfile
Find this compound or compounds like it in BindingDB:
Activity Spreadsheet -- Enzyme Inhibition Constant Data from BindingDB
Found 1 hit for monomerid = 50416070
TargetBeta-2 adrenergic receptor(Homo sapiens (Human))
Glaxosmithkline
Curated by ChEMBL
LigandPNGBDBM50416070(CHEMBL1084654)
Affinity DataEC50:  2.5nM. Assay description: Agonist activity at human recombinant beta2 adrenergic receptor expressed in CHO cells assessed as induction of intracellular cAMP accumulation after...
In DepthDetails ArticlePubMed