BDBM50416275 CHEMBL1083341
SMILES Cc1ccc(s1)C(=O)N1CCCC1c1nc(no1)-c1cccc(Cl)c1
InChI Key InChIKey=ABWONHBWGCZVOP-UHFFFAOYSA-N
Data  1 KI  1 IC50
  Tab Delimited (TSV)   2D SDfile   Computed 3D by Vconf -m prep SDfile
Find this compound or compounds like it in BindingDB:
Activity Spreadsheet -- Enzyme Inhibition Constant Data from BindingDB
Found 2 hits for monomerid = 50416275
TargetMetabotropic glutamate receptor 5(Rattus norvegicus (Rat))
Gedeon Richter
Curated by ChEMBL
LigandPNGBDBM50416275(CHEMBL1083341)
Affinity DataKi:  123nM. Assay description: Displacement of [3H]-M-MPEP from mGluR5 in rat cerebrocortical membranes
In DepthDetails ArticlePubMed
TargetMetabotropic glutamate receptor 5(Rattus norvegicus (Rat))
Gedeon Richter
Curated by ChEMBL
LigandPNGBDBM50416275(CHEMBL1083341)
Affinity DataIC50:  6.61E+3nM. Assay description: Allosteric modulation of mGluR5 in E17 rat neuronal cultures assessed as inhibition of (S)-3,5-dihydroxyphenylglycine-induced calcium level
In DepthDetails ArticlePubMed