BDBM50416488 CHEMBL1209506
SMILES COc1cc(cc(OC)c1OC)C#CCC[N+](C)(C)C
InChI Key InChIKey=WXHXKHRTFUCUFV-UHFFFAOYSA-N
Data  1 KI
  Tab Delimited (TSV)   2D SDfile   Computed 3D by Vconf -m prep SDfile
Find this compound or compounds like it in BindingDB:
Activity Spreadsheet -- Enzyme Inhibition Constant Data from BindingDB
Found 1 hit for monomerid = 50416488
TargetHigh affinity choline transporter 1(Mus musculus)
Northeastern Ohio Universities Colleges Of Medicine And Pharmacy
Curated by ChEMBL
LigandPNGBDBM50416488(CHEMBL1209506)
Affinity DataKi:  2.00E+3nM. Assay description: Inhibition of [3H]choline uptake at choline transporter 1 in mouse brain synaptosome
In DepthDetails ArticlePubMed