BDBM50417031 CHEMBL2062159::WAY-855
SMILES CC(=O)[C@@]1(N)CC[C@@H]2[C@@H]([C@H]12)C(O)=O
InChI Key InChIKey=UGIUXHLMCCHJBN-AYHNYZOXSA-N
Data  2 IC50
  Tab Delimited (TSV)   2D SDfile   Computed 3D by Vconf -m prep SDfile
Find this compound or compounds like it in BindingDB:
Activity Spreadsheet -- Enzyme Inhibition Constant Data from BindingDB
Found 2 hits for monomerid = 50417031
TargetExcitatory amino acid transporter 3(Homo sapiens (Human))
University Of Berne
Curated by ChEMBL
LigandPNGBDBM50417031(CHEMBL2062159 | WAY-855)
Affinity DataIC50:  5.30E+4nM. Assay description: Inhibition of human EAAC1 expressed in Xenopus laevis Oocytes assessed as reduction of [3H]-glutamate uptake after 10 mins by scintillation counting
In DepthDetails ArticlePubMed
TargetExcitatory amino acid transporter 2(Homo sapiens (Human))
University Of Berne
Curated by ChEMBL
LigandPNGBDBM50417031(CHEMBL2062159 | WAY-855)
Affinity DataIC50:  1.30E+3nM. Assay description: Inhibition of human GLT1 expressed in Xenopus laevis Oocytes assessed as reduction of [3H]-glutamate uptake after 10 mins by scintillation counting
In DepthDetails ArticlePubMed