BDBM50417043 CHEMBL1257520
SMILES Cc1ncccc1N1C[C@@]2(CC[C@H](CNc3cnn(c3)-c3ccccc3F)CC2)OC1=O
InChI Key InChIKey=PKFQIEMWIJWVSK-XZMJRDFISA-N
Data  1 KI
  Tab Delimited (TSV)   2D SDfile   Computed 3D by Vconf -m prep SDfile
Find this compound or compounds like it in BindingDB:
Activity Spreadsheet -- Enzyme Inhibition Constant Data from BindingDB
Found 1 hit for monomerid = 50417043
TargetNeuropeptide Y receptor type 5(Homo sapiens (Human))
Glaxosmithkline
Curated by ChEMBL
LigandPNGBDBM50417043(CHEMBL1257520)
Affinity DataKi:  0.631nM. Assay description: Antagonist activity at human NPY Y5 receptor
In DepthDetails ArticlePubMed