BDBM50417056 CHEMBL1258225
SMILES Fc1ccccc1-n1cc(NC[C@H]2CC[C@@]3(CN(C(=O)O3)c3cncnc3)CC2)cn1
InChI Key InChIKey=HLPHLGNPJPSUFS-CIEDQVTBSA-N
Data  1 KI
  Tab Delimited (TSV)   2D SDfile   Computed 3D by Vconf -m prep SDfile
Find this compound or compounds like it in BindingDB:
Activity Spreadsheet -- Enzyme Inhibition Constant Data from BindingDB
Found 1 hit for monomerid = 50417056
TargetNeuropeptide Y receptor type 5(Homo sapiens (Human))
Glaxosmithkline
Curated by ChEMBL
LigandPNGBDBM50417056(CHEMBL1258225)
Affinity DataKi:  0.0398nM. Assay description: Antagonist activity at human NPY Y5 receptor
In DepthDetails ArticlePubMed