BDBM50417727 CHEMBL1644215
SMILES COc1nc(NCC(F)(F)c2ccccc2)cc(n1)-c1cccc(c1)C(C)(C)C(O)=O
InChI Key InChIKey=MUJSAJMEUKIZNS-UHFFFAOYSA-N
Data  1 IC50
  Tab Delimited (TSV)   2D SDfile   Computed 3D by Vconf -m prep SDfile
Find this compound or compounds like it in BindingDB:
Activity Spreadsheet -- Enzyme Inhibition Constant Data from BindingDB
Found 1 hit for monomerid = 50417727
TargetProstaglandin D2 receptor(Homo sapiens (Human))
Sanofi Aventis Us
Curated by ChEMBL
LigandPNGBDBM50417727(CHEMBL1644215)
Affinity DataIC50:  38.0nM. Assay description: Antagonist activity at prostaglandin D2 receptor in human LS174T cells assessed as inhibition of PGD2-induced cAMP accumulation after 15 mins by scin...
In DepthDetails ArticlePubMed