BDBM50417753 CHEMBL1644254
SMILES COc1ccc(CCNc2cc(nc(OC)n2)-c2ccc(cc2)C(C)=O)cc1
InChI Key InChIKey=KVUBQMZZSUGHGH-UHFFFAOYSA-N
Data  1 IC50
  Tab Delimited (TSV)   2D SDfile   Computed 3D by Vconf -m prep SDfile
Find this compound or compounds like it in BindingDB:
Activity Spreadsheet -- Enzyme Inhibition Constant Data from BindingDB
Found 1 hit for monomerid = 50417753
TargetProstaglandin D2 receptor(Homo sapiens (Human))
Sanofi Aventis Us
Curated by ChEMBL
LigandPNGBDBM50417753(CHEMBL1644254)
Affinity DataIC50:  6.31nM. Assay description: Antagonist activity at prostaglandin D2 receptor in human LS174T cells assessed as inhibition of PGD2-induced cAMP accumulation after 15 mins by scin...
In DepthDetails ArticlePubMed