BDBM50417771 CHEMBL1644247
SMILES COc1ccc(CCNc2cc(nc(OC)n2)-c2ccc(F)c(c2)C(O)=O)cc1
InChI Key InChIKey=WSWQENUVDLYIKF-UHFFFAOYSA-N
Data  1 IC50
  Tab Delimited (TSV)   2D SDfile   Computed 3D by Vconf -m prep SDfile
Find this compound or compounds like it in BindingDB:
Activity Spreadsheet -- Enzyme Inhibition Constant Data from BindingDB
Found 1 hit for monomerid = 50417771
TargetProstaglandin D2 receptor(Homo sapiens (Human))
Sanofi Aventis Us
Curated by ChEMBL
LigandPNGBDBM50417771(CHEMBL1644247)
Affinity DataIC50:  0.398nM. Assay description: Antagonist activity at prostaglandin D2 receptor in human LS174T cells assessed as inhibition of PGD2-induced cAMP accumulation after 15 mins by scin...
In DepthDetails ArticlePubMed