BDBM50418103 CHEMBL1762130
SMILES Cn1cccc1C(=O)[C@@H](SN1CCCC1)c1ccccc1
InChI Key InChIKey=SLEHHRFMULXKSA-KRWDZBQOSA-N
Data  1 KI
  Tab Delimited (TSV)   2D SDfile   Computed 3D by Vconf -m prep SDfile
Find this compound or compounds like it in BindingDB:
Activity Spreadsheet -- Enzyme Inhibition Constant Data from BindingDB
Found 1 hit for monomerid = 50418103
TargetAmine oxidase [flavin-containing] A(Homo sapiens (Human))
Bharati Vidyapeeth Deemed University
Curated by ChEMBL
LigandPNGBDBM50418103(CHEMBL1762130)
Affinity DataKi:  8.20E+7nM. Assay description: Inhibition of MAO-A receptor
In DepthDetails ArticlePubMed