BDBM50418104 CHEMBL1762129
SMILES Cn1cccc1C(=O)[C@H](SN1CCCC1)c1ccccc1
InChI Key InChIKey=SLEHHRFMULXKSA-QGZVFWFLSA-N
Data  1 KI
  Tab Delimited (TSV)   2D SDfile   Computed 3D by Vconf -m prep SDfile
Find this compound or compounds like it in BindingDB:
Activity Spreadsheet -- Enzyme Inhibition Constant Data from BindingDB
Found 1 hit for monomerid = 50418104
TargetAmine oxidase [flavin-containing] A(Homo sapiens (Human))
Bharati Vidyapeeth Deemed University
Curated by ChEMBL
LigandPNGBDBM50418104(CHEMBL1762129)
Affinity DataKi:  7.60E+7nM. Assay description: Inhibition of MAO-A receptor
In DepthDetails ArticlePubMed