BDBM50419895 CHEMBL1956873
SMILES Cc1cc(C)c2cccc(OCc3c(Cl)ccc(c3Cl)S(=O)(=O)NC3(CCOCC3)C(=O)N3CCC(CCC[N+](C)(C)C)CC3)c2n1
InChI Key InChIKey=JCOZHDOLJKFXIH-UHFFFAOYSA-N
Data  2 KI  1 Kd
  Tab Delimited (TSV)   2D SDfile   Computed 3D by Vconf -m prep SDfile
Find this compound or compounds like it in BindingDB:
Activity Spreadsheet -- Enzyme Inhibition Constant Data from BindingDB
Found 3 hits for monomerid = 50419895
TargetB2 bradykinin receptor(Homo sapiens (Human))
Menarini Ricerche
Curated by ChEMBL
LigandPNGBDBM50419895(CHEMBL1956873)
Affinity DataKi:  0.501nM. Assay description: Displacement of [3H]-Bradykinin from human bradykinin B2 receptor expressed in CHO cells membrane after 60 mins by scintillation counting
In DepthDetails ArticlePubMed
TargetB1 bradykinin receptor(Homo sapiens (Human))
Menarini Ricerche
Curated by ChEMBL
LigandPNGBDBM50419895(CHEMBL1956873)
Affinity DataKi: >1.00E+4nM. Assay description: Displacement of [3H][desArg9]Lys-Bradykinin from human bradykinin B1 receptor expressed in CHO cells
In DepthDetails ArticlePubMed
TargetB2 bradykinin receptor(Homo sapiens (Human))
Menarini Ricerche
Curated by ChEMBL
LigandPNGBDBM50419895(CHEMBL1956873)
Affinity DataKd:  1.58nM. Assay description: Antagonist activity at human bradykinin B2 receptor expressed in dhfr-deficient CHO cells assessed as inhibition of bradykinin-induced inositol monop...
In DepthDetails ArticlePubMed