BDBM50421558 CHEMBL432627
SMILES COc1c(Br)cc(Br)cc1COCC(N1CCNCC1)c1ccccc1
InChI Key InChIKey=SSSMQSQCNAOVLJ-UHFFFAOYSA-N
Data  1 KI  2 IC50
  Tab Delimited (TSV)   2D SDfile   Computed 3D by Vconf -m prep SDfile
Find this compound or compounds like it in BindingDB:
Activity Spreadsheet -- Enzyme Inhibition Constant Data from BindingDB
Found 2 hits for monomerid = 50421558
TargetSodium-dependent serotonin transporter(Rattus norvegicus (rat))
Ucb Pharma
Curated by ChEMBL
LigandPNGBDBM50421558(CHEMBL432627)
Affinity DataIC50:  6.30nM. Assay description: Binding affinity against Serotonin transporter in rat cerebral cortex using [3H]paroxetine binding assay.
In DepthDetails ArticlePubMed
TargetSubstance-P receptor(Homo sapiens (Human))
Ucb Pharma
Curated by ChEMBL
LigandPNGBDBM50421558(CHEMBL432627)
Affinity DataIC50:  7.90nM. Assay description: Binding affinity against human Tachykinin receptor 1 expressed in CHO cells using [3H]-substance P as the radioligand
In DepthDetails ArticlePubMed