BDBM50422184 CHEMBL140487::Ro-20-1310
SMILES CC(C)(C)N1c2ccc(Cl)cc2C(=NCC1=O)c1ccccc1
InChI Key InChIKey=BXZQVFOYDUQAQB-UHFFFAOYSA-N
Data  1 IC50
  Tab Delimited (TSV)   2D SDfile   Computed 3D by Vconf -m prep SDfile
Find this compound or compounds like it in BindingDB:
Activity Spreadsheet -- Enzyme Inhibition Constant Data from BindingDB
Found 1 hit for monomerid = 50422184
TargetTranslocator protein(Homo sapiens (Human))
Harvard University
Curated by ChEMBL
LigandPNGBDBM50422184(CHEMBL140487 | Ro-20-1310)
Affinity DataIC50:  1.61E+6nM. Assay description: Binding affinity of compound towards Benzodiazepine receptor in a competition assay
In DepthDetails ArticlePubMed