BDBM50422186 CHEMBL147144::Ro-05-3072
SMILES Nc1ccc2NC(=O)CN=C(c3ccccc3)c2c1
InChI Key InChIKey=OYOUQHVDCKOOAL-UHFFFAOYSA-N
Data  1 IC50
  Tab Delimited (TSV)   2D SDfile   Computed 3D by Vconf -m prep SDfile
Find this compound or compounds like it in BindingDB:
Activity Spreadsheet -- Enzyme Inhibition Constant Data from BindingDB
Found 1 hit for monomerid = 50422186
TargetTranslocator protein(Homo sapiens (Human))
Harvard University
Curated by ChEMBL
LigandPNGBDBM50422186(CHEMBL147144 | Ro-05-3072)
Affinity DataIC50:  2.58E+6nM. Assay description: Binding affinity of compound towards Benzodiazepine receptor in a competition assay
In DepthDetails ArticlePubMed