BDBM50422188 MOTRAZEPAM::Ro-06-9098
SMILES COCN1c2ccc(cc2C(=NCC1=O)c1ccccc1)[N+]([O-])=O
InChI Key InChIKey=CWCAUFWLFIUQHP-UHFFFAOYSA-N
Data  1 IC50
  Tab Delimited (TSV)   2D SDfile   Computed 3D by Vconf -m prep SDfile
Find this compound or compounds like it in BindingDB:
Activity Spreadsheet -- Enzyme Inhibition Constant Data from BindingDB
Found 1 hit for monomerid = 50422188
TargetTranslocator protein(Homo sapiens (Human))
Harvard University
Curated by ChEMBL
LigandPNGBDBM50422188(MOTRAZEPAM | Ro-06-9098)
Affinity DataIC50:  2.32E+6nM. Assay description: Binding affinity of compound towards Benzodiazepine receptor in a competition assay
Ligand InfoPC cidPC sid
In DepthDetails ArticlePubMed