BDBM50422303 CHEMBL2364564
SMILES CCCCSc1nc2c(N)ncnc2n1[C@@H]1O[C@H](COP([O-])(=O)OP([O-])(=O)OP([O-])([O-])=O)[C@@H](O)[C@H]1O
InChI Key InChIKey=VVIHCMASBGERAP-QYVSTXNMSA-J
Data  1 EC50
  Tab Delimited (TSV)   2D SDfile   Computed 3D by Vconf -m prep SDfile
Find this compound or compounds like it in BindingDB:
Activity Spreadsheet -- Enzyme Inhibition Constant Data from BindingDB
Found 1 hit for monomerid = 50422303
TargetP2Y purinoceptor 1(Meleagris gallopavo)
Bar-Ilan University
Curated by ChEMBL
LigandPNGBDBM50422303(CHEMBL2364564)
Affinity DataEC50:  1.00E+4nM. Assay description: Compounds was tested for its ability to stimulate phospholipase C activity at the P2Y purinoceptor 1 in turkey erythrocyte membranes.
In DepthDetails ArticlePubMed