BDBM50422392 CHEMBL325505
SMILES CCCCCCCCCN(Cc1ccccc1OC)C(=O)CCCCCN(C)Cc1ccc(cc1)-c1ccc(CN(C)CCCCCC(=O)NCc2ccccc2OC)cc1
InChI Key InChIKey=SYUIYNQIZFURLC-UHFFFAOYSA-N
Data  1 IC50
  Tab Delimited (TSV)   2D SDfile   Computed 3D by Vconf -m prep SDfile
Find this compound or compounds like it in BindingDB:
Activity Spreadsheet -- Enzyme Inhibition Constant Data from BindingDB
Found 1 hit for monomerid = 50422392
TargetAcetylcholinesterase(Homo sapiens (Human))
University Of Bologna
Curated by ChEMBL
LigandPNGBDBM50422392(CHEMBL325505)
Affinity DataIC50:  1.05E+5nM. Assay description: Inhibitory activity on Acetylcholinesterase (AChE) from human erythrocytes
In DepthDetails ArticlePubMed