BDBM50422401 CHEMBL110045
SMILES COc1ccccc1CN1CCCCCC(=O)N(C)CCCCCCCCN(C)C(=O)CCCCCN(Cc2ccccc2OC)Cc2ccc(cc2)-c2ccc(C1)cc2
InChI Key InChIKey=UJFVMFKEMRNCNU-UHFFFAOYSA-N
Data  1 IC50
  Tab Delimited (TSV)   2D SDfile   Computed 3D by Vconf -m prep SDfile
Find this compound or compounds like it in BindingDB:
Activity Spreadsheet -- Enzyme Inhibition Constant Data from BindingDB
Found 1 hit for monomerid = 50422401
TargetAcetylcholinesterase(Homo sapiens (Human))
University Of Bologna
Curated by ChEMBL
LigandPNGBDBM50422401(CHEMBL110045)
Affinity DataIC50:  5.37E+4nM. Assay description: Inhibitory activity on Acetylcholinesterase (AChE) from human erythrocytes
In DepthDetails ArticlePubMed