BDBM50422803 CHEMBL382024
SMILES C[C@@H]1CN([C@H](c2ccc(CCC(O)=O)cc2)c2cccc(O)c2)[C@@H](C)CN1Cc1ccccc1
InChI Key InChIKey=VHCPCUGDMDXMKY-UETOGOEVSA-N
Data  1 IC50
  Tab Delimited (TSV)   2D SDfile   Computed 3D by Vconf -m prep SDfile
Find this compound or compounds like it in BindingDB:
Activity Spreadsheet -- Enzyme Inhibition Constant Data from BindingDB
Found 1 hit for monomerid = 50422803
TargetDelta-type opioid receptor(MOUSE)
Pfizer
Curated by ChEMBL
LigandPNGBDBM50422803(CHEMBL382024)
Affinity DataIC50:  0.126nM. Assay description: Agonist activity at delta opioid receptor in mouse vas deferens
In DepthDetails ArticlePubMed