BDBM50423721 CHEMBL595105
SMILES Cc1ccnc(NCC2CCN(CC2)c2ccc(CC(NC(=O)c3c(C)cc(C)cc3C)C(O)=O)cc2)c1
InChI Key InChIKey=RJFWKMUAMBANKC-UHFFFAOYSA-N
Data  11 IC50
  Tab Delimited (TSV)   2D SDfile   Computed 3D by Vconf -m prep SDfile
Find this compound or compounds like it in BindingDB:
Activity Spreadsheet -- Enzyme Inhibition Constant Data from BindingDB
Found 11 hits for monomerid = 50423721
TargetIntegrin alpha-5(Homo sapiens (Human))
Shire Orphan Therapies
US Patent
LigandPNGBDBM50423721(CHEMBL595105)
Affinity DataIC50: <100nMpH: 9.6 T: 2°C. Assay description: Fibronectin was diluted with coating buffer (15 mM Na2CO3, 35 mM NaHCO3, pH 9.6) and coated with 100 uL/well to Nunc-Immuno maxisorp plates (Nalge Nu...
In DepthDetails US Patent
TargetIntegrin alpha-IIb(Homo sapiens (Human))
Shire Orphan Therapies
US Patent
LigandPNGBDBM50423721(CHEMBL595105)
Affinity DataIC50: >1.00E+3nMpH: 9.6 T: 2°C. Assay description: Fibrinogen was diluted with coating buffer (15 mM Na2CO3, 35 mM NaHCO3, pH 9.6) and coated with 100 uL/well to Nunc-Immuno maxisorp plates over night...
In DepthDetails US Patent
TargetIntegrin alpha-IIb/beta-3(Homo sapiens (Human))
Jerini
Curated by ChEMBL
LigandPNGBDBM50423721(CHEMBL595105)
Affinity DataIC50:  2.30E+3nM. Assay description: Binding affinity to integrin alpha2bbeta3 receptor by ELISA
In DepthDetails ArticlePubMed
TargetIntegrin alpha-V/beta-5(Homo sapiens (Human))
Jerini
Curated by ChEMBL
LigandPNGBDBM50423721(CHEMBL595105)
Affinity DataIC50:  1.10E+3nM. Assay description: Binding affinity to integrin alpha5beta5 receptor by ELISA
In DepthDetails ArticlePubMed
TargetIntegrin alpha-V/beta-3(Homo sapiens (Human))
Jerini
Curated by ChEMBL
LigandPNGBDBM50423721(CHEMBL595105)
Affinity DataIC50:  84nM. Assay description: Binding affinity to integrin alpha5beta3 receptor by ELISA
In DepthDetails ArticlePubMed
TargetIntegrin alpha-5/beta-1(Homo sapiens (Human))
Jerini
Curated by ChEMBL
LigandPNGBDBM50423721(CHEMBL595105)
Affinity DataIC50:  69nM. Assay description: Inhibition of integrin alpha5beta1 receptor-mediated HEK293 cell adhesion
In DepthDetails ArticlePubMed
TargetIntegrin alpha-5/beta-1(Homo sapiens (Human))
Jerini
Curated by ChEMBL
LigandPNGBDBM50423721(CHEMBL595105)
Affinity DataIC50:  2.30nM. Assay description: Inhibition of integrin alpha5beta1 receptor by ELISA
In DepthDetails ArticlePubMed
TargetIntegrin alpha-V/beta-3(Homo sapiens (Human))
Jerini
Curated by ChEMBL
LigandPNGBDBM50423721(CHEMBL595105)
Affinity DataIC50:  84nM. Assay description: Inhibition of integrin alpha5beta3 receptor by ELISA
In DepthDetails ArticlePubMed
TargetIntegrin alpha-V/beta-5(Homo sapiens (Human))
Jerini
Curated by ChEMBL
LigandPNGBDBM50423721(CHEMBL595105)
Affinity DataIC50:  1.07E+4nM. Assay description: Inhibition of integrin alpha5beta5 receptor by ELISA
In DepthDetails ArticlePubMed
TargetIntegrin alpha-IIb/beta-3(Homo sapiens (Human))
Jerini
Curated by ChEMBL
LigandPNGBDBM50423721(CHEMBL595105)
Affinity DataIC50:  2.34E+4nM. Assay description: Inhibition of integrin alpha2bbeta3 receptor by ELISA
In DepthDetails ArticlePubMed
TargetIntegrin alpha-5/beta-1(Homo sapiens (Human))
Jerini
Curated by ChEMBL
LigandPNGBDBM50423721(CHEMBL595105)
Affinity DataIC50:  2.30nM. Assay description: Binding affinity to integrin alpha5beta1 receptor by ELISA
In DepthDetails ArticlePubMed