BDBM50423967 CHEMBL2057417
SMILES Cc1nc2sc(C(=O)NCc3ccncc3)c(N)c2c(C)c1Cl
InChI Key InChIKey=XNCQMFVABACABG-UHFFFAOYSA-N
Data  10 EC50
  Tab Delimited (TSV)   2D SDfile   Computed 3D by Vconf -m prep SDfile
Find this compound or compounds like it in BindingDB:
Activity Spreadsheet -- Enzyme Inhibition Constant Data from BindingDB
Found 10 hits for monomerid = 50423967
TargetMuscarinic acetylcholine receptor M4(Homo sapiens (Human))
Vanderbilt University Medical Center
Curated by ChEMBL
LigandPNGBDBM50423967(CHEMBL2057417)
Affinity DataEC50:  56nM. Assay description: Positive allosteric modulation of human muscarinic M4 receptor expressed in CHO-K1 cells assessed as leftward shift in acetylcholine response treated...
In DepthDetails ArticlePubMed
TargetMuscarinic acetylcholine receptor M5(RAT)
Vanderbilt University Medical Center
Curated by ChEMBL
LigandPNGBDBM50423967(CHEMBL2057417)
Affinity DataEC50: >3.00E+4nM. Assay description: Positive allosteric modulation of rat muscarinic M5 receptor assessed as acetylcholine response
In DepthDetails ArticlePubMed
TargetMuscarinic acetylcholine receptor M5(Homo sapiens (Human))
Vanderbilt University Medical Center
Curated by ChEMBL
LigandPNGBDBM50423967(CHEMBL2057417)
Affinity DataEC50: >3.00E+4nM. Assay description: Positive allosteric modulation of human muscarinic M5 receptor expressed in CHO-K1 cells assessed as leftward shift in acetylcholine response treated...
In DepthDetails ArticlePubMed
TargetMuscarinic acetylcholine receptor M3(RAT)
Vanderbilt University Medical Center
Curated by ChEMBL
LigandPNGBDBM50423967(CHEMBL2057417)
Affinity DataEC50: >3.00E+4nM. Assay description: Positive allosteric modulation of rat muscarinic M3 receptor assessed as acetylcholine response
In DepthDetails ArticlePubMed
TargetMuscarinic acetylcholine receptor M4(RAT)
Vanderbilt University Medical Center
Curated by ChEMBL
LigandPNGBDBM50423967(CHEMBL2057417)
Affinity DataEC50:  176nM. Assay description: Positive allosteric modulation of rat muscarinic M4 receptor assessed as acetylcholine response
In DepthDetails ArticlePubMed
TargetMuscarinic acetylcholine receptor M2(RAT)
Vanderbilt University Medical Center
Curated by ChEMBL
LigandPNGBDBM50423967(CHEMBL2057417)
Affinity DataEC50: >3.00E+4nM. Assay description: Positive allosteric modulation of rat muscarinic M2 receptor assessed as acetylcholine response
In DepthDetails ArticlePubMed
TargetMuscarinic acetylcholine receptor M2(Homo sapiens (Human))
Vanderbilt University Medical Center
Curated by ChEMBL
LigandPNGBDBM50423967(CHEMBL2057417)
Affinity DataEC50: >3.00E+4nM. Assay description: Positive allosteric modulation of human muscarinic M2 receptor expressed in CHO-K1 cells assessed as leftward shift in acetylcholine response treated...
In DepthDetails ArticlePubMed
TargetMuscarinic acetylcholine receptor M1(RAT)
Vanderbilt University Medical Center
Curated by ChEMBL
LigandPNGBDBM50423967(CHEMBL2057417)
Affinity DataEC50: >3.00E+4nM. Assay description: Positive allosteric modulation of rat muscarinic M1 receptor assessed as acetylcholine response
In DepthDetails ArticlePubMed
TargetMuscarinic acetylcholine receptor M1(Homo sapiens (Human))
Vanderbilt University Medical Center
Curated by ChEMBL
LigandPNGBDBM50423967(CHEMBL2057417)
Affinity DataEC50: >3.00E+4nM. Assay description: Positive allosteric modulation of human muscarinic M1 receptor expressed in CHO-K1 cells assessed as leftward shift in acetylcholine response treated...
In DepthDetails ArticlePubMed
TargetMuscarinic acetylcholine receptor M3(Homo sapiens (Human))
Vanderbilt University Medical Center
Curated by ChEMBL
LigandPNGBDBM50423967(CHEMBL2057417)
Affinity DataEC50: >3.00E+4nM. Assay description: Positive allosteric modulation of human muscarinic M3 receptor expressed in CHO-K1 cells assessed as leftward shift in acetylcholine response treated...
In DepthDetails ArticlePubMed