BDBM50425263 CHEMBL2315477
SMILES FC(F)(F)c1cccc(CN2CCC3(CCN(CC3)c3ncc(s3)C(=O)NCCC3CC3)Oc3ccccc23)c1
InChI Key InChIKey=PFDGORURWJXIIB-UHFFFAOYSA-N
Data  1 IC50
  Tab Delimited (TSV)   2D SDfile   Computed 3D by Vconf -m prep SDfile
Find this compound or compounds like it in BindingDB:
Activity Spreadsheet -- Enzyme Inhibition Constant Data from BindingDB
Found 1 hit for monomerid = 50425263
TargetAcyl-CoA desaturase 1(Rattus norvegicus (Rat))
Merck Research Laboratories
Curated by ChEMBL
LigandPNGBDBM50425263(CHEMBL2315477)
Affinity DataIC50:  930nM. Assay description: Inhibition of rat SCD1 by rat microsomal assay
In DepthDetails ArticlePubMed