BDBM50425264 CHEMBL2315478
SMILES FC(F)(F)c1cccc(CN2CCC3(CCN(CC3)c3ccc(cc3)C(=O)NCCC3CC3)Oc3ccccc23)c1
InChI Key InChIKey=VXMOGTFWHJOTAJ-UHFFFAOYSA-N
Data  1 IC50
  Tab Delimited (TSV)   2D SDfile   Computed 3D by Vconf -m prep SDfile
Find this compound or compounds like it in BindingDB:
Activity Spreadsheet -- Enzyme Inhibition Constant Data from BindingDB
Found 1 hit for monomerid = 50425264
TargetAcyl-CoA desaturase 1(Rattus norvegicus (Rat))
Merck Research Laboratories
Curated by ChEMBL
LigandPNGBDBM50425264(CHEMBL2315478)
Affinity DataIC50:  2.20E+3nM. Assay description: Inhibition of rat SCD1 by rat microsomal assay
In DepthDetails ArticlePubMed