BDBM50425281 CHEMBL2315492
SMILES CC(=O)N1CCCC1N1CCC2(CCN(CC2)C(=O)Cc2ccc(cc2)C(C)(C)C)Oc2ccccc12
InChI Key InChIKey=MVCMQTBKHOREIY-UHFFFAOYSA-N
Data  1 IC50
  Tab Delimited (TSV)   2D SDfile   Computed 3D by Vconf -m prep SDfile
Find this compound or compounds like it in BindingDB:
Activity Spreadsheet -- Enzyme Inhibition Constant Data from BindingDB
Found 1 hit for monomerid = 50425281
TargetAcyl-CoA desaturase 1(Rattus norvegicus (Rat))
Merck Research Laboratories
Curated by ChEMBL
LigandPNGBDBM50425281(CHEMBL2315492)
Affinity DataIC50: >1.00E+4nM. Assay description: Inhibition of rat SCD1 by rat microsomal assay
In DepthDetails ArticlePubMed