BDBM50425285 CHEMBL2315496
SMILES CCc1ccc(CN2CCC3(CCN(CC3)C(=O)CNC(C)=O)Oc3ccccc23)cc1
InChI Key InChIKey=ZZFCMBFLUIFMQK-UHFFFAOYSA-N
Data  1 IC50
  Tab Delimited (TSV)   2D SDfile   Computed 3D by Vconf -m prep SDfile
Find this compound or compounds like it in BindingDB:
Activity Spreadsheet -- Enzyme Inhibition Constant Data from BindingDB
Found 1 hit for monomerid = 50425285
TargetAcyl-CoA desaturase 1(Rattus norvegicus (Rat))
Merck Research Laboratories
Curated by ChEMBL
LigandPNGBDBM50425285(CHEMBL2315496)
Affinity DataIC50:  57nM. Assay description: Inhibition of rat SCD1 by rat microsomal assay
In DepthDetails ArticlePubMed