BDBM50425286 CHEMBL2315495
SMILES CC(=O)NCC(=O)N1CCC2(CC1)CCN(Cc1ccc(C)cc1)c1ccccc1O2
InChI Key InChIKey=NLXBSIKKWCLBPF-UHFFFAOYSA-N
Data  1 IC50
  Tab Delimited (TSV)   2D SDfile   Computed 3D by Vconf -m prep SDfile
Find this compound or compounds like it in BindingDB:
Activity Spreadsheet -- Enzyme Inhibition Constant Data from BindingDB
Found 1 hit for monomerid = 50425286
TargetAcyl-CoA desaturase 1(Rattus norvegicus (Rat))
Merck Research Laboratories
Curated by ChEMBL
LigandPNGBDBM50425286(CHEMBL2315495)
Affinity DataIC50:  1.10E+3nM. Assay description: Inhibition of rat SCD1 by rat microsomal assay
In DepthDetails ArticlePubMed