BDBM50425294 CHEMBL2315510
SMILES COc1ccccc1CN1CCC2(CCN(CC2)C(=O)CNC(C)=O)Oc2ccccc12
InChI Key InChIKey=PGGSLPHGZHYFSX-UHFFFAOYSA-N
Data  1 IC50
  Tab Delimited (TSV)   2D SDfile   Computed 3D by Vconf -m prep SDfile
Find this compound or compounds like it in BindingDB:
Activity Spreadsheet -- Enzyme Inhibition Constant Data from BindingDB
Found 1 hit for monomerid = 50425294
TargetAcyl-CoA desaturase 1(Rattus norvegicus (Rat))
Merck Research Laboratories
Curated by ChEMBL
LigandPNGBDBM50425294(CHEMBL2315510)
Affinity DataIC50:  2.90E+3nM. Assay description: Inhibition of rat SCD1 by rat microsomal assay
In DepthDetails ArticlePubMed