BDBM50425295 CHEMBL2315509
SMILES CCc1ccccc1CN1CCC2(CCN(CC2)C(=O)CNC(C)=O)Oc2ccccc12
InChI Key InChIKey=MHBKRUHJDFYEHD-UHFFFAOYSA-N
Data  1 IC50
  Tab Delimited (TSV)   2D SDfile   Computed 3D by Vconf -m prep SDfile
Find this compound or compounds like it in BindingDB:
Activity Spreadsheet -- Enzyme Inhibition Constant Data from BindingDB
Found 1 hit for monomerid = 50425295
TargetAcyl-CoA desaturase 1(Rattus norvegicus (Rat))
Merck Research Laboratories
Curated by ChEMBL
LigandPNGBDBM50425295(CHEMBL2315509)
Affinity DataIC50:  430nM. Assay description: Inhibition of rat SCD1 by rat microsomal assay
In DepthDetails ArticlePubMed