BDBM50425921 CHEMBL2313711
SMILES Fc1ccc2c(noc2c1)C1CCN(CC1)C(=O)C1CCCN1C(=S)Nc1ccccc1F
InChI Key InChIKey=JOPFRRSPOCYUSX-UHFFFAOYSA-N
Data  1 IC50
  Tab Delimited (TSV)   2D SDfile   Computed 3D by Vconf -m prep SDfile
Find this compound or compounds like it in BindingDB:
Activity Spreadsheet -- Enzyme Inhibition Constant Data from BindingDB
Found 1 hit for monomerid = 50425921
TargetAlbumin(Bos taurus)
University Of Mysore
Curated by ChEMBL
LigandPNGBDBM50425921(CHEMBL2313711)
Affinity DataIC50:  7.80E+3nM. Assay description: Inhibition of glycation of bovine serum albumin assessed as advanced glycated end product measured after 7 days by spectrofluorimeter in presence of ...
In DepthDetails ArticlePubMed