BDBM50426146 CHEMBL1419509
SMILES CCOC(=O)C(N(C#N)c1nc(OC)nc(n1)N(C)C)C(=O)OCC
InChI Key InChIKey=IVTAHTNUNZEDPX-UHFFFAOYSA-N
Data  1 IC50
  Tab Delimited (TSV)   2D SDfile   Computed 3D by Vconf -m prep SDfile
Find this compound or compounds like it in BindingDB:
Activity Spreadsheet -- Enzyme Inhibition Constant Data from BindingDB
Found 1 hit for monomerid = 50426146
TargetCathepsin K(Homo sapiens (Human))
Msd Animal Health Innovation
Curated by ChEMBL
LigandPNGBDBM50426146(CHEMBL1419509)
Affinity DataIC50:  4.30E+3nM. Assay description: Inhibition of human recombinant His-tagged cathepsin K using Cbz-Phe-Arg-AMC as substrate incubated for 30 mins prior to substrate addition by FRET a...
In DepthDetails ArticlePubMed