BDBM50426154 CHEMBL2316616
SMILES O[C@H]1[C@@H](Br)[C@H](C#N)N(C(=O)c2ccccc2)c2ccccc12
InChI Key InChIKey=PKNLRSBYSSNFHC-HRCADAONSA-N
Data  1 IC50
  Tab Delimited (TSV)   2D SDfile   Computed 3D by Vconf -m prep SDfile
Find this compound or compounds like it in BindingDB:
Activity Spreadsheet -- Enzyme Inhibition Constant Data from BindingDB
Found 1 hit for monomerid = 50426154
TargetCathepsin K(Homo sapiens (Human))
Msd Animal Health Innovation
Curated by ChEMBL
LigandPNGBDBM50426154(CHEMBL2316616)
Affinity DataIC50: >3.00E+4nM. Assay description: Inhibition of human recombinant His-tagged cathepsin K using Cbz-Phe-Arg-AMC as substrate incubated for 30 mins prior to substrate addition by FRET a...
In DepthDetails ArticlePubMed