BDBM50426155 2-(3-(Phenylsulfonyl)Allylthio)Benzo[D]Thiazole::CHEMBL2316615
SMILES O=S(=O)(\C=C\CSc1nc2ccccc2s1)c1ccccc1
InChI Key InChIKey=QSZGXNRNCININZ-WUXMJOGZSA-N
Data  1 IC50
  Tab Delimited (TSV)   2D SDfile   Computed 3D by Vconf -m prep SDfile
Find this compound or compounds like it in BindingDB:
Activity Spreadsheet -- Enzyme Inhibition Constant Data from BindingDB
Found 1 hit for monomerid = 50426155
TargetCathepsin K(Homo sapiens (Human))
Msd Animal Health Innovation
Curated by ChEMBL
LigandPNGBDBM50426155(2-(3-(Phenylsulfonyl)Allylthio)Benzo[D]Thiazole | ...)
Affinity DataIC50: >3.00E+4nM. Assay description: Inhibition of human recombinant His-tagged cathepsin K using Cbz-Phe-Arg-AMC as substrate incubated for 30 mins prior to substrate addition by FRET a...
In DepthDetails ArticlePubMed