BDBM50426164 CHEMBL2316608
SMILES CC(C)Nc1nc(nc(n1)N(CCOc1ccccc1)C#N)N(C)C
InChI Key InChIKey=WQDHVLNGJKPNDU-UHFFFAOYSA-N
Data  1 IC50
  Tab Delimited (TSV)   2D SDfile   Computed 3D by Vconf -m prep SDfile
Find this compound or compounds like it in BindingDB:
Activity Spreadsheet -- Enzyme Inhibition Constant Data from BindingDB
Found 1 hit for monomerid = 50426164
TargetCathepsin K(Homo sapiens (Human))
Msd Animal Health Innovation
Curated by ChEMBL
LigandPNGBDBM50426164(CHEMBL2316608)
Affinity DataIC50:  1.96E+4nM. Assay description: Inhibition of human recombinant His-tagged cathepsin K using Cbz-Phe-Arg-AMC as substrate incubated for 30 mins prior to substrate addition by FRET a...
In DepthDetails ArticlePubMed