BDBM50426170 CHEMBL2316313
SMILES CC(C)CC(NC(=O)c1ccncc1)C(=O)NCC(=O)CNS(=O)(=O)c1ccc(Oc2ccccc2)cc1
InChI Key InChIKey=MOMCEXADCCCZFN-UHFFFAOYSA-N
Data  1 KI
  Tab Delimited (TSV)   2D SDfile   Computed 3D by Vconf -m prep SDfile
Find this compound or compounds like it in BindingDB:
Activity Spreadsheet -- Enzyme Inhibition Constant Data from BindingDB
Found 1 hit for monomerid = 50426170
TargetCathepsin K(Homo sapiens (Human))
Msd Animal Health Innovation
Curated by ChEMBL
LigandPNGBDBM50426170(CHEMBL2316313)
Affinity DataKi:  13nM. Assay description: Inhibition of cathepsin K (unknown origin)
In DepthDetails ArticlePubMed