BDBM50426529 CHEMBL2323634
SMILES COc1ccc(Nc2nc(nc3scnc23)N2CCCC(C2)C(=O)NCCc2ccncc2)cc1OC
InChI Key InChIKey=RIOKDCGTLFOODO-UHFFFAOYSA-N
Data  1 IC50
  Tab Delimited (TSV)   2D SDfile   Computed 3D by Vconf -m prep SDfile
Find this compound or compounds like it in BindingDB:
Activity Spreadsheet -- Enzyme Inhibition Constant Data from BindingDB
Found 1 hit for monomerid = 50426529
TargetLysine--tRNA ligase(Homo sapiens (Human))
Therachem Research Medilab (India)
Curated by ChEMBL
LigandPNGBDBM50426529(CHEMBL2323634)
Affinity DataIC50:  1.99E+4nM. Assay description: Inhibition of human Gst-tagged Syk expressed in sf9 cells
In DepthDetails ArticlePubMed