BDBM50426808 CHEMBL2322774
SMILES NC(=O)c1ccc2-c3sc(cc3CCOc2c1)-c1nncn1-c1ccccc1Cl
InChI Key InChIKey=HQQMOSDGLIFYLI-UHFFFAOYSA-N
Data  1 IC50
  Tab Delimited (TSV)   2D SDfile   Computed 3D by Vconf -m prep SDfile
Find this compound or compounds like it in BindingDB:
Activity Spreadsheet -- Enzyme Inhibition Constant Data from BindingDB
Found 1 hit for monomerid = 50426808
LigandPNGBDBM50426808(CHEMBL2322774)
Affinity DataIC50:  60nM. Assay description: Inhibition of PI3Kalpha-mediated AKT Ser 473 phosphorylation in human PC3 cells
In DepthDetails ArticlePubMed